{"text_format":"1","workbook":"xlsx","n_sheets":5,"sheets":["Instruções","Tabela de dados","Indicadores","Gráficos","Calendário"],"not_rendered":{"charts":2,"images":13,"macros":1,"external_links":0,"defined_names":5,"comments":0,"pivot_tables":0},"unopened":[],"bounds":{"document_bytes":16777216,"sheet_cells":100000,"rows_first":2000,"rows_last":500,"rows_between":2000,"halvings":0,"cell_chars":16384,"cell_head_chars":4096},"cells_cut":0,"cells_raw":0,"read":"whole","date_system":"1900"}

{"sheet":"Instruções","index":0,"n_rows":254,"n_cols":5,"rows_kept":254,"cut":false,"hidden":false,"merged":[[1,4,3,12],[4,4,4,12],[253,1,253,5]]}
[]
[null,null,null,null,"Indicadores de Recursos Humanos"]
[]
[]
[null,null,null,null,"Cortesia do site Corellis Page"]
[]
[null,"Esta é uma contribuição aos colegas de Recursos Humanos, onde ajudo a criar os indicadores mais comuns."]
[]
[null,"Há outros até mais importantes, mas não são generalizáveis, e portanto há a impossibilidade de se colocar, em "]
[null,"um trabalho como este, todas as variáveis."]
[]
[null,"Segue abaixo, algumas instruções que lhe ajudarão a utilizar bem esta planilha."]
[]
[null,"Tabela de dados"]
[]
[null,null,"É nesta planilha em que são inseridos os dados para a obtenção dos índices."]
[]
[null,null,"Os dados são inseridos nas células com letras em azul."]
[]
[]
[]
[]
[]
[]
[]
[]
[]
[]
[null,null,"As células em verde são cálculos feitos de acordo com o calendário do mês e ano."]
[]
[null,null,"O ano você define clicando nos botões, até aparecer o ano que deseja criar o índice."]
[]
[]
[]
[]
[null,null,"Os valores possíveis estão entre 2009 e 2050. Não tem os índices do ano passado? Aproveite para fazer agora!"]
[]
[null,null,"Todas as datas como dias úteis, sábados, domingos e feriados são ajustadas pelo ano."]
[]
[null,null,"Para ter um cálculo correto dos dias trabalhados, você deve informar se sua empresa trabalha, ou não, aos "]
[null,null,"sábados. "]
[]
[]
[]
[]
[null,"Calendário"]
[]
[null,null,"Para usar a planilha, é necessário verificar se todos os feriados de sua cidade e estado estão apontados no"]
[null,null,"calendário. Se o calendário não estiver atualizado os índices sairão errados."]
[]
[null,null,"As datas constantes no formato original são feriados nacionais e os da Cidade de São Paulo, capital do "]
[null,null,"Estado de São Paulo."]
[]
[null,null,"Altere as datas constantes no quadro verde."]
[null,null,"Obs:","As datas referente ao carnaval e Páscoa são datas móveis, estão em vermelho, e não podem"]
[null,null,null,"ser alteradas."]
[]
[]
[null,"Indicadores"]
[]
[null,null,"Cuidado:","Esta planilha está desprotegida para permitir que você altere os meses que aparecem no gráfico"]
[null,null,null,"e que serão impressos."]
[]
[]
[]
[]
[]
[]
[]
[]
[]
[null,null,"Todas as inclusões devem ser feitas na planilha TABELA DE DADOS."]
[]
[null,null,"Os dados contidos nesta planilha são importados da Tabela de Dados."]
[]
[null,null,"Para você visualizar todos os meses, clique no sinal de \"+\" no camo postrado na figura abaixo."]
[]
[]
[]
[]
[]
[]
[]
[]
[]
[]
[]
[]
[]
[]
[]
[]
[null,null,"Todos os meses serão mostrados em seguida."]
[]
[null,null,"Note que o mês de fevereiro não está presente, mas já foram adicionados valores para ele na"]
[null,null,"planilha Tabela de Dados."]
[]
[null,null,"Para que os valores de um mês, no exemplo Fevereiro, seja mostrado, faça o seguinte:"]
[]
[null,null,"Depois que todos os meses estiverem amostra, clique na coluna correspondente ao mês que"]
[null,null,"deseja mostrar, colocar no gráfico e imprimir no relatório."]
[]
[]
[]
[]
[]
[]
[]
[]
[]
[]
[]
[]
[]
[]
[null,null,"Observe que toda a coluna foi selecionada!"]
[]
[null,null,"Depois clique na divisória DADOS, e na opção DESAGRUPAR."]
[]
[]
[]
[]
[]
[]
[]
[]
[]
[]
[]
[]
[]
[]
[]
[]
[]
[]
[]
[]
[]
[]
[]
[null,null,"Veja que a barra que existia em cima da coluna \"E\" sumiu. Ela foi desagrupada."]
[]
[]
[]
[]
[]
[]
[]
[]
[]
[]
[]
[]
[]
[]
[]
[]
[]
[]
[]
[]
[]
[]
[]
[null,null,"Para esconder novamente as colunas agrupadas, clique no botão \"-\", que está próximo ao mês de"]
[null,null,"Dezembro, como mostrado na figura abaixo."]
[]
[]
[]
[]
[]
[]
[]
[]
[]
[]
[]
[]
[]
[]
[null,null,"Com isso, a impressão do relatório já está pronta e os gráficos conterão apenas os dados dos meses que "]
[null,null,"possuem informações."]
[]
[null,null,"Dica:","Para esconder um mês, basta mostrar todos, clicar na coluna correspondente ao mês que se "]
[null,null,null,"deseja esconder, e depois, na divisória DADOS, clicar na opção AGRUPAR. Experimente!"]
[]
[null,null,"Veja os gráficos."]
[]
[]
[]
[]
[]
[]
[]
[]
[]
[]
[]
[]
[]
[]
[]
[]
[]
[]
[]
[]
[]
[]
[]
[]
[]
[]
[]
[]
[]
[]
[]
[]
[]
[]
[]
[]
[]
[]
[]
[]
[null,null,"Dica:","Para colar os gráficos no Word e Power Point:"]
[]
[null,null,null,"1-","Clique no gráfico e copie (Ctrl+C)."]
[null,null,null,"2-","Vá para o Word ou Power Point."]
[null,null,null,"3-","Utilise o Colar Especial (Ctrl+Alt+V)"]
[null,null,null,"4-","Escolha a opção Bitmap"]
[]
[null,null,null,"Pronto! Seu gráfico está colado."]
[]
[null,null,"Dica:","Para ajustar o tamanho do gráfico sem alterar suas proporções, clique no gráfico, depois"]
[null,null,null,"em uma das \"bolinhas\" que aparecem nos cantos do gráfico."]
[]
[null,null,null,"Pressione a tecla \"Shift\" e a mantenha pressionada enquanto arrasta o canto do gráfico."]
[]
[]
[]
[]
[]
[]
[]
[]
[null,"Sucesso!"]
[]
[]
[]
[null,"Entre em contato:  corelli@geraldcorelli.com"]

{"sheet":"Tabela de dados","index":1,"n_rows":22,"n_cols":15,"rows_kept":22,"cut":false,"hidden":false,"merged":[[19,1,19,2],[4,1,4,2],[13,1,13,2],[15,1,15,2],[16,1,16,2],[17,1,17,2],[18,1,18,2],[8,1,8,2],[9,1,9,2],[10,1,10,2],[11,1,11,2],[12,1,12,2],[14,1,14,2]]}
[]
[]
[]
[]
[null,"Tabela para cálculo de indicadores de RH"]
[null,"Ano"]
[null,2010,false]
[]
[null,"Informação",null,"2010-01-01","2010-02-01","2010-03-01","2010-04-01","2010-05-01","2010-06-01","2010-07-01","2010-08-01","2010-09-01","2010-10-01","2010-11-01","2010-12-01"]
[null,"Quant. de empregados",null,100,105]
[null,"Dias do mês",null,{"$f":"IF(D10=\"\",\"\",COUNTIF(Calendário!$D$6:$D$371,MONTH(D9)))","v":31},{"$f":"IF(E10=\"\",\"\",COUNTIF(Calendário!$D$6:$D$371,MONTH(E9)))","v":28},{"$f":"IF(F10=\"\",\"\",COUNTIF(Calendário!$D$6:$D$371,MONTH(F9)))","v":""},{"$f":"IF(G10=\"\",\"\",COUNTIF(Calendário!$D$6:$D$371,MONTH(G9)))","v":""},{"$f":"IF(H10=\"\",\"\",COUNTIF(Calendário!$D$6:$D$371,MONTH(H9)))","v":""},{"$f":"IF(I10=\"\",\"\",COUNTIF(Calendário!$D$6:$D$371,MONTH(I9)))","v":""},{"$f":"IF(J10=\"\",\"\",COUNTIF(Calendário!$D$6:$D$371,MONTH(J9)))","v":""},{"$f":"IF(K10=\"\",\"\",COUNTIF(Calendário!$D$6:$D$371,MONTH(K9)))","v":""},{"$f":"IF(L10=\"\",\"\",COUNTIF(Calendário!$D$6:$D$371,MONTH(L9)))","v":""},{"$f":"IF(M10=\"\",\"\",COUNTIF(Calendário!$D$6:$D$371,MONTH(M9)))","v":""},{"$f":"IF(N10=\"\",\"\",COUNTIF(Calendário!$D$6:$D$371,MONTH(N9)))","v":""},{"$f":"IF(O10=\"\",\"\",COUNTIF(Calendário!$D$6:$D$371,MONTH(O9)))","v":""}]
[null,"Feriados e DSR",null,{"$f":"IF(D10=\"\",\"\",IF('Tabela de dados'!$C$7=TRUE,COUNTIF(Calendário!$F$6:$F$371,CONCATENATE(MONTH(D9),1)),COUNTIF(Calendário!$F$6:$F$371,CONCATENATE(MONTH(D9),1))+COUNTIF(Calendário!$F$6:$F$371,CONCATENATE(MONTH(D9),7)))+COUNTIF(Calendário!$G$6:$G$371,MONTH(D9)&\"feriado\"))","v":12},{"$f":"IF(E10=\"\",\"\",IF('Tabela de dados'!$C$7=TRUE,COUNTIF(Calendário!$F$6:$F$371,CONCATENATE(MONTH(E9),1)),COUNTIF(Calendário!$F$6:$F$371,CONCATENATE(MONTH(E9),1))+COUNTIF(Calendário!$F$6:$F$371,CONCATENATE(MONTH(E9),7)))+COUNTIF(Calendário!$G$6:$G$371,MONTH(E9)&\"feriado\"))","v":10},{"$f":"IF(F10=\"\",\"\",IF('Tabela de dados'!$C$7=TRUE,COUNTIF(Calendário!$F$6:$F$371,CONCATENATE(MONTH(F9),1)),COUNTIF(Calendário!$F$6:$F$371,CONCATENATE(MONTH(F9),1))+COUNTIF(Calendário!$F$6:$F$371,CONCATENATE(MONTH(F9),7)))+COUNTIF(Calendário!$G$6:$G$371,MONTH(F9)&\"feriado\"))","v":""},{"$f":"IF(G10=\"\",\"\",IF('Tabela de dados'!$C$7=TRUE,COUNTIF(Calendário!$F$6:$F$371,CONCATENATE(MONTH(G9),1)),COUNTIF(Calendário!$F$6:$F$371,CONCATENATE(MONTH(G9),1))+COUNTIF(Calendário!$F$6:$F$371,CONCATENATE(MONTH(G9),7)))+COUNTIF(Calendário!$G$6:$G$371,MONTH(G9)&\"feriado\"))","v":""},{"$f":"IF(H10=\"\",\"\",IF('Tabela de dados'!$C$7=TRUE,COUNTIF(Calendário!$F$6:$F$371,CONCATENATE(MONTH(H9),1)),COUNTIF(Calendário!$F$6:$F$371,CONCATENATE(MONTH(H9),1))+COUNTIF(Calendário!$F$6:$F$371,CONCATENATE(MONTH(H9),7)))+COUNTIF(Calendário!$G$6:$G$371,MONTH(H9)&\"feriado\"))","v":""},{"$f":"IF(I10=\"\",\"\",IF('Tabela de dados'!$C$7=TRUE,COUNTIF(Calendário!$F$6:$F$371,CONCATENATE(MONTH(I9),1)),COUNTIF(Calendário!$F$6:$F$371,CONCATENATE(MONTH(I9),1))+COUNTIF(Calendário!$F$6:$F$371,CONCATENATE(MONTH(I9),7)))+COUNTIF(Calendário!$G$6:$G$371,MONTH(I9)&\"feriado\"))","v":""},{"$f":"IF(J10=\"\",\"\",IF('Tabela de dados'!$C$7=TRUE,COUNTIF(Calendário!$F$6:$F$371,CONCATENATE(MONTH(J9),1)),COUNTIF(Calendário!$F$6:$F$371,CONCATENATE(MONTH(J9),1))+COUNTIF(Calendário!$F$6:$F$371,CONCATENATE(MONTH(J9),7)))+COUNTIF(Calendário!$G$6:$G$371,MONTH(J9)&\"feriado\"))","v":""},{"$f":"IF(K10=\"\",\"\",IF('Tabela de dados'!$C$7=TRUE,COUNTIF(Calendário!$F$6:$F$371,CONCATENATE(MONTH(K9),1)),COUNTIF(Calendário!$F$6:$F$371,CONCATENATE(MONTH(K9),1))+COUNTIF(Calendário!$F$6:$F$371,CONCATENATE(MONTH(K9),7)))+COUNTIF(Calendário!$G$6:$G$371,MONTH(K9)&\"feriado\"))","v":""},{"$f":"IF(L10=\"\",\"\",IF('Tabela de dados'!$C$7=TRUE,COUNTIF(Calendário!$F$6:$F$371,CONCATENATE(MONTH(L9),1)),COUNTIF(Calendário!$F$6:$F$371,CONCATENATE(MONTH(L9),1))+COUNTIF(Calendário!$F$6:$F$371,CONCATENATE(MONTH(L9),7)))+COUNTIF(Calendário!$G$6:$G$371,MONTH(L9)&\"feriado\"))","v":""},{"$f":"IF(M10=\"\",\"\",IF('Tabela de dados'!$C$7=TRUE,COUNTIF(Calendário!$F$6:$F$371,CONCATENATE(MONTH(M9),1)),COUNTIF(Calendário!$F$6:$F$371,CONCATENATE(MONTH(M9),1))+COUNTIF(Calendário!$F$6:$F$371,CONCATENATE(MONTH(M9),7)))+COUNTIF(Calendário!$G$6:$G$371,MONTH(M9)&\"feriado\"))","v":""},{"$f":"IF(N10=\"\",\"\",IF('Tabela de dados'!$C$7=TRUE,COUNTIF(Calendário!$F$6:$F$371,CONCATENATE(MONTH(N9),1)),COUNTIF(Calendário!$F$6:$F$371,CONCATENATE(MONTH(N9),1))+COUNTIF(Calendário!$F$6:$F$371,CONCATENATE(MONTH(N9),7)))+COUNTIF(Calendário!$G$6:$G$371,MONTH(N9)&\"feriado\"))","v":""},{"$f":"IF(O10=\"\",\"\",IF('Tabela de dados'!$C$7=TRUE,COUNTIF(Calendário!$F$6:$F$371,CONCATENATE(MONTH(O9),1)),COUNTIF(Calendário!$F$6:$F$371,CONCATENATE(MONTH(O9),1))+COUNTIF(Calendário!$F$6:$F$371,CONCATENATE(MONTH(O9),7)))+COUNTIF(Calendário!$G$6:$G$371,MONTH(O9)&\"feriado\"))","v":""}]
[null,"Dias de trabalho",null,{"$f":"IF(D10=\"\",\"\",D11-D12)","v":19},{"$f":"IF(E10=\"\",\"\",E11-E12)","v":18},{"$f":"IF(F10=\"\",\"\",F11-F12)","v":""},{"$f":"IF(G10=\"\",\"\",G11-G12)","v":""},{"$f":"IF(H10=\"\",\"\",H11-H12)","v":""},{"$f":"IF(I10=\"\",\"\",I11-I12)","v":""},{"$f":"IF(J10=\"\",\"\",J11-J12)","v":""},{"$f":"IF(K10=\"\",\"\",K11-K12)","v":""},{"$f":"IF(L10=\"\",\"\",L11-L12)","v":""},{"$f":"IF(M10=\"\",\"\",M11-M12)","v":""},{"$f":"IF(N10=\"\",\"\",N11-N12)","v":""},{"$f":"IF(O10=\"\",\"\",O11-O12)","v":""}]
[null,"Dias de trab. x Emp.",null,{"$f":"IF(D13=\"\",\"\",D13*D10)","v":1900},{"$f":"IF(E13=\"\",\"\",E13*E10)","v":1890},{"$f":"IF(F13=\"\",\"\",F13*F10)","v":""},{"$f":"IF(G13=\"\",\"\",G13*G10)","v":""},{"$f":"IF(H13=\"\",\"\",H13*H10)","v":""},{"$f":"IF(I13=\"\",\"\",I13*I10)","v":""},{"$f":"IF(J13=\"\",\"\",J13*J10)","v":""},{"$f":"IF(K13=\"\",\"\",K13*K10)","v":""},{"$f":"IF(L13=\"\",\"\",L13*L10)","v":""},{"$f":"IF(M13=\"\",\"\",M13*M10)","v":""},{"$f":"IF(N13=\"\",\"\",N13*N10)","v":""},{"$f":"IF(O13=\"\",\"\",O13*O10)","v":""}]
[null,"Quantidade de admissões",null,2,1]
[null,"Quantidade total de faltas",null,100,85]
[null,"Quantidade total de Rescisões",null,3,1]
[null,"Quantidade de Dispensados",null,2,1]
[null,"Quantidade de Pedidos de Demissão",null,1,0]
[null,"Quant. de Rescisões com menos de um ano",null,2,0]
[]
[null,"Cortesia do site Corellis Page"]

{"sheet":"Indicadores","index":2,"n_rows":44,"n_cols":15,"rows_kept":44,"cut":false,"hidden":false,"merged":[[8,14,9,14],[8,8,9,8],[8,9,9,9],[8,10,9,10],[8,11,9,11],[8,12,9,12],[8,13,9,13],[8,7,9,7],[32,1,32,2],[38,1,38,2],[11,1,11,2],[16,1,16,2],[26,1,26,2],[9,1,9,2],[8,1,8,2],[8,3,9,3],[8,4,9,4],[8,5,9,5],[8,6,9,6],[21,1,21,2]]}
[]
[]
[]
[]
[]
[]
[]
[]
[null,"Indicadores",null,"2010-01-01","2010-02-01","2010-03-01","2010-04-01","2010-05-01","2010-06-01","2010-07-01","2010-08-01","2010-09-01","2010-10-01","2010-11-01","2010-12-01"]
[null,{"$f":"ano","v":2010}]
[]
[]
[]
[null,null,"Indicador no mês",{"$f":"IF('Tabela de dados'!D$10=\"\",\"\",'Tabela de dados'!D16/'Tabela de dados'!D14)","v":5.2631578947368418E-2},{"$f":"IF('Tabela de dados'!E$10=\"\",\"\",'Tabela de dados'!E16/'Tabela de dados'!E14)","v":4.4973544973544971E-2},{"$f":"IF('Tabela de dados'!F$10=\"\",\"\",'Tabela de dados'!F16/'Tabela de dados'!F14)","v":""},{"$f":"IF('Tabela de dados'!G$10=\"\",\"\",'Tabela de dados'!G16/'Tabela de dados'!G14)","v":""},{"$f":"IF('Tabela de dados'!H$10=\"\",\"\",'Tabela de dados'!H16/'Tabela de dados'!H14)","v":""},{"$f":"IF('Tabela de dados'!I$10=\"\",\"\",'Tabela de dados'!I16/'Tabela de dados'!I14)","v":""},{"$f":"IF('Tabela de dados'!J$10=\"\",\"\",'Tabela de dados'!J16/'Tabela de dados'!J14)","v":""},{"$f":"IF('Tabela de dados'!K$10=\"\",\"\",'Tabela de dados'!K16/'Tabela de dados'!K14)","v":""},{"$f":"IF('Tabela de dados'!L$10=\"\",\"\",'Tabela de dados'!L16/'Tabela de dados'!L14)","v":""},{"$f":"IF('Tabela de dados'!M$10=\"\",\"\",'Tabela de dados'!M16/'Tabela de dados'!M14)","v":""},{"$f":"IF('Tabela de dados'!N$10=\"\",\"\",'Tabela de dados'!N16/'Tabela de dados'!N14)","v":""},{"$f":"IF('Tabela de dados'!O$10=\"\",\"\",'Tabela de dados'!O16/'Tabela de dados'!O14)","v":""}]
[null,null,"Média no ano",{"$f":"IF('Tabela de dados'!D$10=\"\",\"\",AVERAGE($D14,D14))","v":5.2631578947368418E-2},{"$f":"IF('Tabela de dados'!E$10=\"\",\"\",AVERAGE($D14,E14))","v":4.8802561960456695E-2},{"$f":"IF('Tabela de dados'!F$10=\"\",\"\",AVERAGE($D14,F14))","v":""},{"$f":"IF('Tabela de dados'!G$10=\"\",\"\",AVERAGE($D14,G14))","v":""},{"$f":"IF('Tabela de dados'!H$10=\"\",\"\",AVERAGE($D14,H14))","v":""},{"$f":"IF('Tabela de dados'!I$10=\"\",\"\",AVERAGE($D14,I14))","v":""},{"$f":"IF('Tabela de dados'!J$10=\"\",\"\",AVERAGE($D14,J14))","v":""},{"$f":"IF('Tabela de dados'!K$10=\"\",\"\",AVERAGE($D14,K14))","v":""},{"$f":"IF('Tabela de dados'!L$10=\"\",\"\",AVERAGE($D14,L14))","v":""},{"$f":"IF('Tabela de dados'!M$10=\"\",\"\",AVERAGE($D14,M14))","v":""},{"$f":"IF('Tabela de dados'!N$10=\"\",\"\",AVERAGE($D14,N14))","v":""},{"$f":"IF('Tabela de dados'!O$10=\"\",\"\",AVERAGE($D14,O14))","v":""}]
[]
[]
[]
[null,null,"Indicador no mês",{"$f":"IF('Tabela de dados'!D$10=\"\",\"\",(('Tabela de dados'!D17+'Tabela de dados'!D15)/2)/'Tabela de dados'!D$10)","v":2.5000000000000001E-2},{"$f":"IF('Tabela de dados'!E$10=\"\",\"\",(('Tabela de dados'!E17+'Tabela de dados'!E15)/2)/'Tabela de dados'!E$10)","v":9.5238095238095247E-3},{"$f":"IF('Tabela de dados'!F$10=\"\",\"\",(('Tabela de dados'!F17+'Tabela de dados'!F15)/2)/'Tabela de dados'!F$10)","v":""},{"$f":"IF('Tabela de dados'!G$10=\"\",\"\",(('Tabela de dados'!G17+'Tabela de dados'!G15)/2)/'Tabela de dados'!G$10)","v":""},{"$f":"IF('Tabela de dados'!H$10=\"\",\"\",(('Tabela de dados'!H17+'Tabela de dados'!H15)/2)/'Tabela de dados'!H$10)","v":""},{"$f":"IF('Tabela de dados'!I$10=\"\",\"\",(('Tabela de dados'!I17+'Tabela de dados'!I15)/2)/'Tabela de dados'!I$10)","v":""},{"$f":"IF('Tabela de dados'!J$10=\"\",\"\",(('Tabela de dados'!J17+'Tabela de dados'!J15)/2)/'Tabela de dados'!J$10)","v":""},{"$f":"IF('Tabela de dados'!K$10=\"\",\"\",(('Tabela de dados'!K17+'Tabela de dados'!K15)/2)/'Tabela de dados'!K$10)","v":""},{"$f":"IF('Tabela de dados'!L$10=\"\",\"\",(('Tabela de dados'!L17+'Tabela de dados'!L15)/2)/'Tabela de dados'!L$10)","v":""},{"$f":"IF('Tabela de dados'!M$10=\"\",\"\",(('Tabela de dados'!M17+'Tabela de dados'!M15)/2)/'Tabela de dados'!M$10)","v":""},{"$f":"IF('Tabela de dados'!N$10=\"\",\"\",(('Tabela de dados'!N17+'Tabela de dados'!N15)/2)/'Tabela de dados'!N$10)","v":""},{"$f":"IF('Tabela de dados'!O$10=\"\",\"\",(('Tabela de dados'!O17+'Tabela de dados'!O15)/2)/'Tabela de dados'!O$10)","v":""}]
[null,null,"Média no ano",{"$f":"IF('Tabela de dados'!D$10=\"\",\"\",AVERAGE($D19,D19))","v":2.5000000000000001E-2},{"$f":"IF('Tabela de dados'!E$10=\"\",\"\",AVERAGE($D19,E19))","v":1.7261904761904763E-2},{"$f":"IF('Tabela de dados'!F$10=\"\",\"\",AVERAGE($D19,F19))","v":""},{"$f":"IF('Tabela de dados'!G$10=\"\",\"\",AVERAGE($D19,G19))","v":""},{"$f":"IF('Tabela de dados'!H$10=\"\",\"\",AVERAGE($D19,H19))","v":""},{"$f":"IF('Tabela de dados'!I$10=\"\",\"\",AVERAGE($D19,I19))","v":""},{"$f":"IF('Tabela de dados'!J$10=\"\",\"\",AVERAGE($D19,J19))","v":""},{"$f":"IF('Tabela de dados'!K$10=\"\",\"\",AVERAGE($D19,K19))","v":""},{"$f":"IF('Tabela de dados'!L$10=\"\",\"\",AVERAGE($D19,L19))","v":""},{"$f":"IF('Tabela de dados'!M$10=\"\",\"\",AVERAGE($D19,M19))","v":""},{"$f":"IF('Tabela de dados'!N$10=\"\",\"\",AVERAGE($D19,N19))","v":""},{"$f":"IF('Tabela de dados'!O$10=\"\",\"\",AVERAGE($D19,O19))","v":""}]
[]
[]
[]
[null,null,"Indicador no mês",{"$f":"IF('Tabela de dados'!D$10=\"\",\"\",'Tabela de dados'!D17/'Tabela de dados'!D10)","v":0.03},{"$f":"IF('Tabela de dados'!E$10=\"\",\"\",'Tabela de dados'!E17/'Tabela de dados'!E10)","v":9.5238095238095247E-3},{"$f":"IF('Tabela de dados'!F$10=\"\",\"\",'Tabela de dados'!F17/'Tabela de dados'!F10)","v":""},{"$f":"IF('Tabela de dados'!G$10=\"\",\"\",'Tabela de dados'!G17/'Tabela de dados'!G10)","v":""},{"$f":"IF('Tabela de dados'!H$10=\"\",\"\",'Tabela de dados'!H17/'Tabela de dados'!H10)","v":""},{"$f":"IF('Tabela de dados'!I$10=\"\",\"\",'Tabela de dados'!I17/'Tabela de dados'!I10)","v":""},{"$f":"IF('Tabela de dados'!J$10=\"\",\"\",'Tabela de dados'!J17/'Tabela de dados'!J10)","v":""},{"$f":"IF('Tabela de dados'!K$10=\"\",\"\",'Tabela de dados'!K17/'Tabela de dados'!K10)","v":""},{"$f":"IF('Tabela de dados'!L$10=\"\",\"\",'Tabela de dados'!L17/'Tabela de dados'!L10)","v":""},{"$f":"IF('Tabela de dados'!M$10=\"\",\"\",'Tabela de dados'!M17/'Tabela de dados'!M10)","v":""},{"$f":"IF('Tabela de dados'!N$10=\"\",\"\",'Tabela de dados'!N17/'Tabela de dados'!N10)","v":""},{"$f":"IF('Tabela de dados'!O$10=\"\",\"\",'Tabela de dados'!O17/'Tabela de dados'!O10)","v":""}]
[null,null,"Média no ano",{"$f":"IF('Tabela de dados'!D$10=\"\",\"\",AVERAGE($D24,D24))","v":0.03},{"$f":"IF('Tabela de dados'!E$10=\"\",\"\",AVERAGE($D24,E24))","v":1.9761904761904762E-2},{"$f":"IF('Tabela de dados'!F$10=\"\",\"\",AVERAGE($D24,F24))","v":""},{"$f":"IF('Tabela de dados'!G$10=\"\",\"\",AVERAGE($D24,G24))","v":""},{"$f":"IF('Tabela de dados'!H$10=\"\",\"\",AVERAGE($D24,H24))","v":""},{"$f":"IF('Tabela de dados'!I$10=\"\",\"\",AVERAGE($D24,I24))","v":""},{"$f":"IF('Tabela de dados'!J$10=\"\",\"\",AVERAGE($D24,J24))","v":""},{"$f":"IF('Tabela de dados'!K$10=\"\",\"\",AVERAGE($D24,K24))","v":""},{"$f":"IF('Tabela de dados'!L$10=\"\",\"\",AVERAGE($D24,L24))","v":""},{"$f":"IF('Tabela de dados'!M$10=\"\",\"\",AVERAGE($D24,M24))","v":""},{"$f":"IF('Tabela de dados'!N$10=\"\",\"\",AVERAGE($D24,N24))","v":""},{"$f":"IF('Tabela de dados'!O$10=\"\",\"\",AVERAGE($D24,O24))","v":""}]
[]
[]
[]
[null,null,"Indicador no mês",{"$f":"IF('Tabela de dados'!D$10=\"\",\"\",'Tabela de dados'!D18/'Tabela de dados'!D$10)","v":0.02},{"$f":"IF('Tabela de dados'!E$10=\"\",\"\",'Tabela de dados'!E18/'Tabela de dados'!E$10)","v":9.5238095238095247E-3},{"$f":"IF('Tabela de dados'!F$10=\"\",\"\",'Tabela de dados'!F18/'Tabela de dados'!F$10)","v":""},{"$f":"IF('Tabela de dados'!G$10=\"\",\"\",'Tabela de dados'!G18/'Tabela de dados'!G$10)","v":""},{"$f":"IF('Tabela de dados'!H$10=\"\",\"\",'Tabela de dados'!H18/'Tabela de dados'!H$10)","v":""},{"$f":"IF('Tabela de dados'!I$10=\"\",\"\",'Tabela de dados'!I18/'Tabela de dados'!I$10)","v":""},{"$f":"IF('Tabela de dados'!J$10=\"\",\"\",'Tabela de dados'!J18/'Tabela de dados'!J$10)","v":""},{"$f":"IF('Tabela de dados'!K$10=\"\",\"\",'Tabela de dados'!K18/'Tabela de dados'!K$10)","v":""},{"$f":"IF('Tabela de dados'!L$10=\"\",\"\",'Tabela de dados'!L18/'Tabela de dados'!L$10)","v":""},{"$f":"IF('Tabela de dados'!M$10=\"\",\"\",'Tabela de dados'!M18/'Tabela de dados'!M$10)","v":""},{"$f":"IF('Tabela de dados'!N$10=\"\",\"\",'Tabela de dados'!N18/'Tabela de dados'!N$10)","v":""},{"$f":"IF('Tabela de dados'!O$10=\"\",\"\",'Tabela de dados'!O18/'Tabela de dados'!O$10)","v":""}]
[null,null,"Média no ano",{"$f":"IF('Tabela de dados'!D$10=\"\",\"\",AVERAGE($D29,D29))","v":0.02},{"$f":"IF('Tabela de dados'!E$10=\"\",\"\",AVERAGE($D29,E29))","v":1.4761904761904763E-2},{"$f":"IF('Tabela de dados'!F$10=\"\",\"\",AVERAGE($D29,F29))","v":""},{"$f":"IF('Tabela de dados'!G$10=\"\",\"\",AVERAGE($D29,G29))","v":""},{"$f":"IF('Tabela de dados'!H$10=\"\",\"\",AVERAGE($D29,H29))","v":""},{"$f":"IF('Tabela de dados'!I$10=\"\",\"\",AVERAGE($D29,I29))","v":""},{"$f":"IF('Tabela de dados'!J$10=\"\",\"\",AVERAGE($D29,J29))","v":""},{"$f":"IF('Tabela de dados'!K$10=\"\",\"\",AVERAGE($D29,K29))","v":""},{"$f":"IF('Tabela de dados'!L$10=\"\",\"\",AVERAGE($D29,L29))","v":""},{"$f":"IF('Tabela de dados'!M$10=\"\",\"\",AVERAGE($D29,M29))","v":""},{"$f":"IF('Tabela de dados'!N$10=\"\",\"\",AVERAGE($D29,N29))","v":""},{"$f":"IF('Tabela de dados'!O$10=\"\",\"\",AVERAGE($D29,O29))","v":""}]
[null,null,"Relação com Turnover total",{"$f":"IF('Tabela de dados'!D$10=\"\",\"\",D29/D$19)","v":0.79999999999999993},{"$f":"IF('Tabela de dados'!E$10=\"\",\"\",IF(E$19=0,0,E29/E$19))","v":1},{"$f":"IF('Tabela de dados'!F$10=\"\",\"\",IF(F$19=0,0,F29/F$19))","v":""},{"$f":"IF('Tabela de dados'!G$10=\"\",\"\",IF(G$19=0,0,G29/G$19))","v":""},{"$f":"IF('Tabela de dados'!H$10=\"\",\"\",IF(H$19=0,0,H29/H$19))","v":""},{"$f":"IF('Tabela de dados'!I$10=\"\",\"\",IF(I$19=0,0,I29/I$19))","v":""},{"$f":"IF('Tabela de dados'!J$10=\"\",\"\",IF(J$19=0,0,J29/J$19))","v":""},{"$f":"IF('Tabela de dados'!K$10=\"\",\"\",IF(K$19=0,0,K29/K$19))","v":""},{"$f":"IF('Tabela de dados'!L$10=\"\",\"\",IF(L$19=0,0,L29/L$19))","v":""},{"$f":"IF('Tabela de dados'!M$10=\"\",\"\",IF(M$19=0,0,M29/M$19))","v":""},{"$f":"IF('Tabela de dados'!N$10=\"\",\"\",IF(N$19=0,0,N29/N$19))","v":""},{"$f":"IF('Tabela de dados'!O$10=\"\",\"\",IF(O$19=0,0,O29/O$19))","v":""}]
[]
[]
[]
[null,null,"Indicador no mês",{"$f":"IF('Tabela de dados'!D$10=\"\",\"\",'Tabela de dados'!D19/'Tabela de dados'!D$10)","v":0.01},{"$f":"IF('Tabela de dados'!E$10=\"\",\"\",'Tabela de dados'!E19/'Tabela de dados'!E$10)","v":0},{"$f":"IF('Tabela de dados'!F$10=\"\",\"\",'Tabela de dados'!F19/'Tabela de dados'!F$10)","v":""},{"$f":"IF('Tabela de dados'!G$10=\"\",\"\",'Tabela de dados'!G19/'Tabela de dados'!G$10)","v":""},{"$f":"IF('Tabela de dados'!H$10=\"\",\"\",'Tabela de dados'!H19/'Tabela de dados'!H$10)","v":""},{"$f":"IF('Tabela de dados'!I$10=\"\",\"\",'Tabela de dados'!I19/'Tabela de dados'!I$10)","v":""},{"$f":"IF('Tabela de dados'!J$10=\"\",\"\",'Tabela de dados'!J19/'Tabela de dados'!J$10)","v":""},{"$f":"IF('Tabela de dados'!K$10=\"\",\"\",'Tabela de dados'!K19/'Tabela de dados'!K$10)","v":""},{"$f":"IF('Tabela de dados'!L$10=\"\",\"\",'Tabela de dados'!L19/'Tabela de dados'!L$10)","v":""},{"$f":"IF('Tabela de dados'!M$10=\"\",\"\",'Tabela de dados'!M19/'Tabela de dados'!M$10)","v":""},{"$f":"IF('Tabela de dados'!N$10=\"\",\"\",'Tabela de dados'!N19/'Tabela de dados'!N$10)","v":""},{"$f":"IF('Tabela de dados'!O$10=\"\",\"\",'Tabela de dados'!O19/'Tabela de dados'!O$10)","v":""}]
[null,null,"Média no ano",{"$f":"IF('Tabela de dados'!D$10=\"\",\"\",AVERAGE($D35,D35))","v":0.01},{"$f":"IF('Tabela de dados'!E$10=\"\",\"\",AVERAGE($D35,E35))","v":5.0000000000000001E-3},{"$f":"IF('Tabela de dados'!F$10=\"\",\"\",AVERAGE($D35,F35))","v":""},{"$f":"IF('Tabela de dados'!G$10=\"\",\"\",AVERAGE($D35,G35))","v":""},{"$f":"IF('Tabela de dados'!H$10=\"\",\"\",AVERAGE($D35,H35))","v":""},{"$f":"IF('Tabela de dados'!I$10=\"\",\"\",AVERAGE($D35,I35))","v":""},{"$f":"IF('Tabela de dados'!J$10=\"\",\"\",AVERAGE($D35,J35))","v":""},{"$f":"IF('Tabela de dados'!K$10=\"\",\"\",AVERAGE($D35,K35))","v":""},{"$f":"IF('Tabela de dados'!L$10=\"\",\"\",AVERAGE($D35,L35))","v":""},{"$f":"IF('Tabela de dados'!M$10=\"\",\"\",AVERAGE($D35,M35))","v":""},{"$f":"IF('Tabela de dados'!N$10=\"\",\"\",AVERAGE($D35,N35))","v":""},{"$f":"IF('Tabela de dados'!O$10=\"\",\"\",AVERAGE($D35,O35))","v":""}]
[null,null,"Relação com Turnover total",{"$f":"IF('Tabela de dados'!D$10=\"\",\"\",D35/D$19)","v":0.39999999999999997},{"$f":"IF('Tabela de dados'!E$10=\"\",\"\",IF(E$19=0,0,E35/E$19))","v":0},{"$f":"IF('Tabela de dados'!F$10=\"\",\"\",IF(F$19=0,0,F35/F$19))","v":""},{"$f":"IF('Tabela de dados'!G$10=\"\",\"\",IF(G$19=0,0,G35/G$19))","v":""},{"$f":"IF('Tabela de dados'!H$10=\"\",\"\",IF(H$19=0,0,H35/H$19))","v":""},{"$f":"IF('Tabela de dados'!I$10=\"\",\"\",IF(I$19=0,0,I35/I$19))","v":""},{"$f":"IF('Tabela de dados'!J$10=\"\",\"\",IF(J$19=0,0,J35/J$19))","v":""},{"$f":"IF('Tabela de dados'!K$10=\"\",\"\",IF(K$19=0,0,K35/K$19))","v":""},{"$f":"IF('Tabela de dados'!L$10=\"\",\"\",IF(L$19=0,0,L35/L$19))","v":""},{"$f":"IF('Tabela de dados'!M$10=\"\",\"\",IF(M$19=0,0,M35/M$19))","v":""},{"$f":"IF('Tabela de dados'!N$10=\"\",\"\",IF(N$19=0,0,N35/N$19))","v":""},{"$f":"IF('Tabela de dados'!O$10=\"\",\"\",IF(O$19=0,0,O35/O$19))","v":""}]
[]
[]
[]
[null,null,"Indicador no mês",{"$f":"IF('Tabela de dados'!D$10=\"\",\"\",'Tabela de dados'!D20/'Tabela de dados'!D$10)","v":0.02},{"$f":"IF('Tabela de dados'!E$10=\"\",\"\",'Tabela de dados'!E20/'Tabela de dados'!E$10)","v":0},{"$f":"IF('Tabela de dados'!F$10=\"\",\"\",'Tabela de dados'!F20/'Tabela de dados'!F$10)","v":""},{"$f":"IF('Tabela de dados'!G$10=\"\",\"\",'Tabela de dados'!G20/'Tabela de dados'!G$10)","v":""},{"$f":"IF('Tabela de dados'!H$10=\"\",\"\",'Tabela de dados'!H20/'Tabela de dados'!H$10)","v":""},{"$f":"IF('Tabela de dados'!I$10=\"\",\"\",'Tabela de dados'!I20/'Tabela de dados'!I$10)","v":""},{"$f":"IF('Tabela de dados'!J$10=\"\",\"\",'Tabela de dados'!J20/'Tabela de dados'!J$10)","v":""},{"$f":"IF('Tabela de dados'!K$10=\"\",\"\",'Tabela de dados'!K20/'Tabela de dados'!K$10)","v":""},{"$f":"IF('Tabela de dados'!L$10=\"\",\"\",'Tabela de dados'!L20/'Tabela de dados'!L$10)","v":""},{"$f":"IF('Tabela de dados'!M$10=\"\",\"\",'Tabela de dados'!M20/'Tabela de dados'!M$10)","v":""},{"$f":"IF('Tabela de dados'!N$10=\"\",\"\",'Tabela de dados'!N20/'Tabela de dados'!N$10)","v":""},{"$f":"IF('Tabela de dados'!O$10=\"\",\"\",'Tabela de dados'!O20/'Tabela de dados'!O$10)","v":""}]
[null,null,"Média no ano",{"$f":"IF('Tabela de dados'!D$10=\"\",\"\",AVERAGE($D41,D41))","v":0.02},{"$f":"IF('Tabela de dados'!E$10=\"\",\"\",AVERAGE($D41,E41))","v":0.01},{"$f":"IF('Tabela de dados'!F$10=\"\",\"\",AVERAGE($D41,F41))","v":""},{"$f":"IF('Tabela de dados'!G$10=\"\",\"\",AVERAGE($D41,G41))","v":""},{"$f":"IF('Tabela de dados'!H$10=\"\",\"\",AVERAGE($D41,H41))","v":""},{"$f":"IF('Tabela de dados'!I$10=\"\",\"\",AVERAGE($D41,I41))","v":""},{"$f":"IF('Tabela de dados'!J$10=\"\",\"\",AVERAGE($D41,J41))","v":""},{"$f":"IF('Tabela de dados'!K$10=\"\",\"\",AVERAGE($D41,K41))","v":""},{"$f":"IF('Tabela de dados'!L$10=\"\",\"\",AVERAGE($D41,L41))","v":""},{"$f":"IF('Tabela de dados'!M$10=\"\",\"\",AVERAGE($D41,M41))","v":""},{"$f":"IF('Tabela de dados'!N$10=\"\",\"\",AVERAGE($D41,N41))","v":""},{"$f":"IF('Tabela de dados'!O$10=\"\",\"\",AVERAGE($D41,O41))","v":""}]
[null,null,"Relação com Turnover total",{"$f":"IF('Tabela de dados'!D$10=\"\",\"\",D41/D$19)","v":0.79999999999999993},{"$f":"IF('Tabela de dados'!E$10=\"\",\"\",IF(E$19=0,0,E41/E$19))","v":0},{"$f":"IF('Tabela de dados'!F$10=\"\",\"\",IF(F$19=0,0,F41/F$19))","v":""},{"$f":"IF('Tabela de dados'!G$10=\"\",\"\",IF(G$19=0,0,G41/G$19))","v":""},{"$f":"IF('Tabela de dados'!H$10=\"\",\"\",IF(H$19=0,0,H41/H$19))","v":""},{"$f":"IF('Tabela de dados'!I$10=\"\",\"\",IF(I$19=0,0,I41/I$19))","v":""},{"$f":"IF('Tabela de dados'!J$10=\"\",\"\",IF(J$19=0,0,J41/J$19))","v":""},{"$f":"IF('Tabela de dados'!K$10=\"\",\"\",IF(K$19=0,0,K41/K$19))","v":""},{"$f":"IF('Tabela de dados'!L$10=\"\",\"\",IF(L$19=0,0,L41/L$19))","v":""},{"$f":"IF('Tabela de dados'!M$10=\"\",\"\",IF(M$19=0,0,M41/M$19))","v":""},{"$f":"IF('Tabela de dados'!N$10=\"\",\"\",IF(N$19=0,0,N41/N$19))","v":""},{"$f":"IF('Tabela de dados'!O$10=\"\",\"\",IF(O$19=0,0,O41/O$19))","v":""}]
[null,"Cortesia do site Corellis Page"]

{"sheet":"Gráficos","index":3,"n_rows":36,"n_cols":14,"rows_kept":36,"cut":false,"hidden":false,"merged":[]}
[]
[]
[]
[]
[]
[]
[]
[]
[]
[]
[]
[]
[]
[]
[]
[]
[]
[]
[]
[]
[]
[]
[]
[]
[]
[]
[]
[]
[]
[]
[]
[null,"Rescisões",null,null,{"$f":"Indicadores!F19","v":""},{"$f":"Indicadores!G19","v":""},{"$f":"Indicadores!H19","v":""},{"$f":"Indicadores!I19","v":""},{"$f":"Indicadores!J19","v":""},{"$f":"Indicadores!K19","v":""},{"$f":"Indicadores!L19","v":""},{"$f":"Indicadores!M19","v":""},{"$f":"Indicadores!N19","v":""},{"$f":"Indicadores!O19","v":""}]
[null,"Demitidos",null,null,{"$f":"Indicadores!F29","v":""},{"$f":"Indicadores!G29","v":""},{"$f":"Indicadores!H29","v":""},{"$f":"Indicadores!I29","v":""},{"$f":"Indicadores!J29","v":""},{"$f":"Indicadores!K29","v":""},{"$f":"Indicadores!L29","v":""},{"$f":"Indicadores!M29","v":""},{"$f":"Indicadores!N29","v":""},{"$f":"Indicadores!O29","v":""}]
[null,"Pedidos",null,null,{"$f":"Indicadores!F35","v":""},{"$f":"Indicadores!G35","v":""},{"$f":"Indicadores!H35","v":""},{"$f":"Indicadores!I35","v":""},{"$f":"Indicadores!J35","v":""},{"$f":"Indicadores!K35","v":""},{"$f":"Indicadores!L35","v":""},{"$f":"Indicadores!M35","v":""},{"$f":"Indicadores!N35","v":""},{"$f":"Indicadores!O35","v":""}]
[null,"Menos de 1 ano",null,null,{"$f":"Indicadores!F41","v":""},{"$f":"Indicadores!G41","v":""},{"$f":"Indicadores!H41","v":""},{"$f":"Indicadores!I41","v":""},{"$f":"Indicadores!J41","v":""},{"$f":"Indicadores!K41","v":""},{"$f":"Indicadores!L41","v":""},{"$f":"Indicadores!M41","v":""},{"$f":"Indicadores!N41","v":""},{"$f":"Indicadores!O41","v":""}]
[null,"Média Turnover",null,null,{"$f":"Indicadores!F20","v":""},{"$f":"Indicadores!G20","v":""},{"$f":"Indicadores!H20","v":""},{"$f":"Indicadores!I20","v":""},{"$f":"Indicadores!J20","v":""},{"$f":"Indicadores!K20","v":""},{"$f":"Indicadores!L20","v":""},{"$f":"Indicadores!M20","v":""},{"$f":"Indicadores!N20","v":""},{"$f":"Indicadores!O20","v":""}]

{"sheet":"Calendário","index":4,"n_rows":371,"n_cols":24,"rows_kept":371,"cut":false,"hidden":false,"merged":[[3,21,3,22],[8,21,9,22],[3,11,3,14]]}
[]
[]
[]
[null,"Semana do ano","Data","Flag mês","Flag DSR","Flag 1","Flag 2","Status da data","Início e fim da semana","flag",null,"FERIADOS",null,null,null,null,null,"Dias da semana",null,null,null,"Algoritmo de Meeus/Jones/Butcher"]
[null,null,null,null,null,null,null,null,null,null,null,"Dia","Mês",null,"Descrição"]
[null,{"$f":"WEEKNUM(C6)","v":1},{"$f":"DATE(ano,1,1)","v":"2010-01-01"},{"$f":"MONTH(C6)","v":1},{"$f":"WEEKDAY(C6)","v":6},{"$f":"D6&E6","v":"16"},{"$f":"IF(AND(OR(E6=1,E6=7),H6=\"feriado\"),\"\",CONCATENATE(D6,H6))","v":"1Feriado"},{"$f":"IF(ISNA(VLOOKUP(C6,feriados,1,FALSE)),VLOOKUP(WEEKDAY(C6,1),$R$6:$S$12,2,TRUE),\"Feriado\")","v":"Feriado"},{"$f":"TEXT(DAY(C6),\"dd\")&\"-\"&TEXT(DAY(C6+7-E6),\"dd\")","v":"01-02"},{"$f":"CONCATENATE(B6,H6)","v":"1Feriado"},null,1,1,{"$f":"IF(L6=\"\",\"\",DATE(ano,M6,L6))","v":"2010-01-01"},"Confraternização Universal",null,null,1,"Domingo"]
[null,1,{"$f":"+C6+1","v":"2010-01-02"},1,7,{"$f":"D7&E7","v":"17"},{"$f":"IF(AND(OR(E7=1,E7=7),H7=\"feriado\"),\"\",CONCATENATE(D7,H7))","v":"1Sábado"},"Sábado",{"$f":"IF(E7=1,TEXT(DAY(C7),\"dd\")&\"-\"&TEXT(DAY(C7+7-E7),\"dd\"),\"\")","v":""},"1Sábado",null,25,1,{"$f":"IF(L7=\"\",\"\",DATE(ano,M7,L7))","v":"2010-01-25"},"Aniversário de São Paulo (SP)",null,null,2,"Segunda-feira",null,null,"Outro algoritmo que pode ser usado é o de Meeus/Jones/Butcher (para o calendário gregoriano), exposto por Jean Meeus em Astronomical Algorithms (1991):",null," "]
[null,2,"2010-01-03",1,1,"11","1Domingo","Domingo","03-09","2Domingo",null,null,null,{"$f":"Páscoa-47","v":"2010-02-16"},"Terça de Carnaval",null,null,3,"Terça-feira"]
[null,2,"2010-01-04",1,2,"12","1Segunda-feira","Segunda-feira","","2Segunda-feira",null,null,null,{"$f":"Páscoa-46","v":"2010-02-17"},"Quarta feira de Cinzas",null,null,4,"Quarta-feira",null,null,"O sinal \"\\\" refere-se à divisão por inteiro: 7\\3 é igual a 2, não a 2,333..."]
[null,2,"2010-01-05",1,3,"13","1Terça-feira","Terça-feira","","2Terça-feira",null,null,null,{"$f":"Páscoa","v":"2010-04-04"},"Páscoa",null,null,5,"Quinta-feira"]
[null,2,"2010-01-06",1,4,"14","1Quarta-feira","Quarta-feira","","2Quarta-feira",null,21,4,{"$f":"IF(L11=\"\",\"\",DATE(ano,M11,L11))","v":"2010-04-21"},"Tiradentes",null,null,6,"Sexta-feira",null,null,"a = MOD(ANO;19)",{"$f":"MOD(ano,19)","v":15}]
[null,2,"2010-01-07",1,5,"15","1Quinta-feira","Quinta-feira","","2Quinta-feira",null,1,5,"2010-05-01","Dia do Trabalho",null,null,7,"Sábado"]
[null,2,"2010-01-08",1,6,"16","1Sexta-feira","Sexta-feira","","2Sexta-feira",null,7,9,"2010-09-07","Proclamação da Independência do Brasil",null,null,null,null,null,null,"b = ANO \\ 100",{"$f":"INT(ano/100)","v":20}]
[null,2,"2010-01-09",1,7,"17","1Sábado","Sábado","","2Sábado",null,2,11,"2010-11-02","Finados"]
[null,3,"2010-01-10",1,1,"11","1Domingo","Domingo","10-16","3Domingo",null,15,11,"2010-11-15","Proclamação da República",null,null,null,null,null,null,"c = MOD(ANO;100)",{"$f":"MOD(ano,100)","v":10}]
[null,3,"2010-01-11",1,2,"12","1Segunda-feira","Segunda-feira","","3Segunda-feira",null,20,11,"2010-11-20","Dia da Consciência Negra (SP)"]
[null,3,"2010-01-12",1,3,"13","1Terça-feira","Terça-feira","","3Terça-feira",null,25,12,"2010-12-25","Natal",null,null,null,null,null,null,"d = b \\ 4",{"$f":"INT(W13/4)","v":5}]
[null,3,"2010-01-13",1,4,"14","1Quarta-feira","Quarta-feira","","3Quarta-feira",null,null,null,""]
[null,3,"2010-01-14",1,5,"15","1Quinta-feira","Quinta-feira","","3Quinta-feira",null,null,null,"",null,null,null,null,null,null,null,"e = MOD(b;4)",{"$f":"MOD(W13,4)","v":0}]
[null,3,"2010-01-15",1,6,"16","1Sexta-feira","Sexta-feira","","3Sexta-feira",null,null,null,""]
[null,3,"2010-01-16",1,7,"17","1Sábado","Sábado","","3Sábado",null,null,null,"",null,null,null,null,null,null,null,"f = (b + 8) \\ 25",{"$f":"INT((W13+8)/25)","v":1}]
[null,4,"2010-01-17",1,1,"11","1Domingo","Domingo","17-23","4Domingo",null,null,null,""]
[null,4,"2010-01-18",1,2,"12","1Segunda-feira","Segunda-feira","","4Segunda-feira",null,null,null,null,null,null,null,null,null,null,null,"g = (b - f + 1) \\ 3",{"$f":"INT((W13-W21)/3)","v":6}]
[null,4,"2010-01-19",1,3,"13","1Terça-feira","Terça-feira","","4Terça-feira"]
[null,4,"2010-01-20",1,4,"14","1Quarta-feira","Quarta-feira","","4Quarta-feira",null,null,null,{"$f":"IF(L25=\"\",\"\",DATE(ano,M25,L25))","v":""},null,null,null,null,null,null,null,"h = MOD((19 × a + b - d - g + 15);30)",{"$f":"MOD((19*W11+(W13-W17-W23+15)),30)","v":9}]
[null,4,"2010-01-21",1,5,"15","1Quinta-feira","Quinta-feira","","4Quinta-feira",null,null,null,""]
[null,4,"2010-01-22",1,6,"16","1Sexta-feira","Sexta-feira","","4Sexta-feira",null,null,null,"",null,null,null,null,null,null,null,"i = c \\ 4",{"$f":"INT(W15/4)","v":2}]
[null,4,"2010-01-23",1,7,"17","1Sábado","Sábado","","4Sábado",null,null,null,""]
[null,5,"2010-01-24",1,1,"11","1Domingo","Domingo","24-30","5Domingo",null,null,null,"",null,null,null,null,null,null,null,"k = MOD(c;4)",{"$f":"MOD(W15,4)","v":2}]
[null,5,"2010-01-25",1,2,"12","1Feriado","Feriado","","5Feriado",null,null,null,""]
[null,5,"2010-01-26",1,3,"13","1Terça-feira","Terça-feira","","5Terça-feira",null,null,null,"",null,null,null,null,null,null,null,"L = MOD((32 + 2 × e + 2 × i - h - k);7)",{"$f":"MOD((32+(2*W19)+(2*W27)-W25-W29),7)","v":4}]
[null,5,"2010-01-27",1,4,"14","1Quarta-feira","Quarta-feira","","5Quarta-feira",null,null,null,""]
[null,5,"2010-01-28",1,5,"15","1Quinta-feira","Quinta-feira","","5Quinta-feira",null,null,null,"",null,null,null,null,null,null,null,"m = (a + 11 × h + 22 × L) \\ 451",{"$f":"INT((W11+11*W25+22*W31)/451)","v":0}]
[null,5,"2010-01-29",1,6,"16","1Sexta-feira","Sexta-feira","","5Sexta-feira",null,null,null,""]
[null,5,"2010-01-30",1,7,"17","1Sábado","Sábado","","5Sábado",null,null,null,"",null,null,null,null,null,null,null,"MÊS = (h + L - 7 × m + 114) \\ 31",{"$f":"INT((W25+W31-7*W33+114)/31)","v":4}]
[null,6,"2010-01-31",1,1,"11","1Domingo","Domingo","31-06","6Domingo",null,null,null,""]
[null,6,"2010-02-01",2,2,"22","2Segunda-feira","Segunda-feira","","6Segunda-feira",null,null,null,"",null,null,null,null,null,null,null,"DIA = MOD((h + L - 7 × m + 114);31) + 1",{"$f":"MOD((W25+W31-7*W33+114),31)+1","v":4}]
[null,6,"2010-02-02",2,3,"23","2Terça-feira","Terça-feira","","6Terça-feira",null,null,null,""]
[null,6,"2010-02-03",2,4,"24","2Quarta-feira","Quarta-feira","","6Quarta-feira",null,null,null,"",null,null,null,null,null,null,null,"Páscoa    ",{"$f":"DATE(ano,W35,W37)","v":"2010-04-04"}]
[null,6,"2010-02-04",2,5,"25","2Quinta-feira","Quinta-feira","","6Quinta-feira",null,null,null,""]
[null,6,"2010-02-05",2,6,"26","2Sexta-feira","Sexta-feira","","6Sexta-feira",null,null,null,""]
[null,6,"2010-02-06",2,7,"27","2Sábado","Sábado","","6Sábado",null,null,null,""]
[null,7,"2010-02-07",2,1,"21","2Domingo","Domingo","07-13","7Domingo",null,null,null,""]
[null,7,"2010-02-08",2,2,"22","2Segunda-feira","Segunda-feira","","7Segunda-feira",null,null,null,""]
[null,7,"2010-02-09",2,3,"23","2Terça-feira","Terça-feira","","7Terça-feira",null,null,null,""]
[null,7,"2010-02-10",2,4,"24","2Quarta-feira","Quarta-feira","","7Quarta-feira",null,null,null,""]
[null,7,"2010-02-11",2,5,"25","2Quinta-feira","Quinta-feira","","7Quinta-feira",null,null,null,""]
[null,7,"2010-02-12",2,6,"26","2Sexta-feira","Sexta-feira","","7Sexta-feira",null,null,null,""]
[null,7,"2010-02-13",2,7,"27","2Sábado","Sábado","","7Sábado",null,null,null,""]
[null,8,"2010-02-14",2,1,"21","2Domingo","Domingo","14-20","8Domingo",null,null,null,""]
[null,8,"2010-02-15",2,2,"22","2Segunda-feira","Segunda-feira","","8Segunda-feira",null,null,null,""]
[null,8,"2010-02-16",2,3,"23","2Feriado","Feriado","","8Feriado",null,null,null,""]
[null,8,"2010-02-17",2,4,"24","2Feriado","Feriado","","8Feriado",null,null,null,""]
[null,8,"2010-02-18",2,5,"25","2Quinta-feira","Quinta-feira","","8Quinta-feira",null,null,null,""]
[null,8,"2010-02-19",2,6,"26","2Sexta-feira","Sexta-feira","","8Sexta-feira"]
[null,8,"2010-02-20",2,7,"27","2Sábado","Sábado","","8Sábado"]
[null,9,"2010-02-21",2,1,"21","2Domingo","Domingo","21-27","9Domingo"]
[null,9,"2010-02-22",2,2,"22","2Segunda-feira","Segunda-feira","","9Segunda-feira"]
[null,9,"2010-02-23",2,3,"23","2Terça-feira","Terça-feira","","9Terça-feira"]
[null,9,"2010-02-24",2,4,"24","2Quarta-feira","Quarta-feira","","9Quarta-feira"]
[null,9,"2010-02-25",2,5,"25","2Quinta-feira","Quinta-feira","","9Quinta-feira"]
[null,9,"2010-02-26",2,6,"26","2Sexta-feira","Sexta-feira","","9Sexta-feira"]
[null,9,"2010-02-27",2,7,"27","2Sábado","Sábado","","9Sábado"]
[null,10,"2010-02-28",2,1,"21","2Domingo","Domingo","28-06","10Domingo"]
[null,10,"2010-03-01",3,2,"32","3Segunda-feira","Segunda-feira","","10Segunda-feira"]
[null,10,"2010-03-02",3,3,"33","3Terça-feira","Terça-feira","","10Terça-feira"]
[null,10,"2010-03-03",3,4,"34","3Quarta-feira","Quarta-feira","","10Quarta-feira"]
[null,10,"2010-03-04",3,5,"35","3Quinta-feira","Quinta-feira","","10Quinta-feira"]
[null,10,"2010-03-05",3,6,"36","3Sexta-feira","Sexta-feira","","10Sexta-feira"]
[null,{"$f":"WEEKNUM(C70)","v":10},"2010-03-06",{"$f":"MONTH(C70)","v":3},{"$f":"WEEKDAY(C70)","v":7},"37","3Sábado",{"$f":"IF(ISNA(VLOOKUP(C70,feriados,1,FALSE)),VLOOKUP(WEEKDAY(C70,1),$R$6:$S$12,2,TRUE),\"Feriado\")","v":"Sábado"},"",{"$f":"CONCATENATE(B70,H70)","v":"10Sábado"}]
[null,11,{"$f":"+C70+1","v":"2010-03-07"},3,1,{"$f":"D71&E71","v":"31"},{"$f":"IF(AND(OR(E71=1,E71=7),H71=\"feriado\"),\"\",CONCATENATE(D71,H71))","v":"3Domingo"},"Domingo",{"$f":"IF(E71=1,TEXT(DAY(C71),\"dd\")&\"-\"&TEXT(DAY(C71+7-E71),\"dd\"),\"\")","v":"07-13"},"11Domingo"]
[null,11,"2010-03-08",3,2,"32","3Segunda-feira","Segunda-feira","","11Segunda-feira"]
[null,11,"2010-03-09",3,3,"33","3Terça-feira","Terça-feira","","11Terça-feira"]
[null,11,"2010-03-10",3,4,"34","3Quarta-feira","Quarta-feira","","11Quarta-feira"]
[null,11,"2010-03-11",3,5,"35","3Quinta-feira","Quinta-feira","","11Quinta-feira"]
[null,11,"2010-03-12",3,6,"36","3Sexta-feira","Sexta-feira","","11Sexta-feira"]
[null,11,"2010-03-13",3,7,"37","3Sábado","Sábado","","11Sábado"]
[null,12,"2010-03-14",3,1,"31","3Domingo","Domingo","14-20","12Domingo"]
[null,12,"2010-03-15",3,2,"32","3Segunda-feira","Segunda-feira","","12Segunda-feira"]
[null,12,"2010-03-16",3,3,"33","3Terça-feira","Terça-feira","","12Terça-feira"]
[null,12,"2010-03-17",3,4,"34","3Quarta-feira","Quarta-feira","","12Quarta-feira"]
[null,12,"2010-03-18",3,5,"35","3Quinta-feira","Quinta-feira","","12Quinta-feira"]
[null,12,"2010-03-19",3,6,"36","3Sexta-feira","Sexta-feira","","12Sexta-feira"]
[null,12,"2010-03-20",3,7,"37","3Sábado","Sábado","","12Sábado"]
[null,13,"2010-03-21",3,1,"31","3Domingo","Domingo","21-27","13Domingo"]
[null,13,"2010-03-22",3,2,"32","3Segunda-feira","Segunda-feira","","13Segunda-feira"]
[null,13,"2010-03-23",3,3,"33","3Terça-feira","Terça-feira","","13Terça-feira"]
[null,13,"2010-03-24",3,4,"34","3Quarta-feira","Quarta-feira","","13Quarta-feira"]
[null,13,"2010-03-25",3,5,"35","3Quinta-feira","Quinta-feira","","13Quinta-feira"]
[null,13,"2010-03-26",3,6,"36","3Sexta-feira","Sexta-feira","","13Sexta-feira"]
[null,13,"2010-03-27",3,7,"37","3Sábado","Sábado","","13Sábado"]
[null,14,"2010-03-28",3,1,"31","3Domingo","Domingo","28-03","14Domingo"]
[null,14,"2010-03-29",3,2,"32","3Segunda-feira","Segunda-feira","","14Segunda-feira"]
[null,14,"2010-03-30",3,3,"33","3Terça-feira","Terça-feira","","14Terça-feira"]
[null,14,"2010-03-31",3,4,"34","3Quarta-feira","Quarta-feira","","14Quarta-feira"]
[null,14,"2010-04-01",4,5,"45","4Quinta-feira","Quinta-feira","","14Quinta-feira"]
[null,14,"2010-04-02",4,6,"46","4Sexta-feira","Sexta-feira","","14Sexta-feira"]
[null,14,"2010-04-03",4,7,"47","4Sábado","Sábado","","14Sábado"]
[null,15,"2010-04-04",4,1,"41","","Feriado","04-10","15Feriado"]
[null,15,"2010-04-05",4,2,"42","4Segunda-feira","Segunda-feira","","15Segunda-feira"]
[null,15,"2010-04-06",4,3,"43","4Terça-feira","Terça-feira","","15Terça-feira"]
[null,15,"2010-04-07",4,4,"44","4Quarta-feira","Quarta-feira","","15Quarta-feira"]
[null,15,"2010-04-08",4,5,"45","4Quinta-feira","Quinta-feira","","15Quinta-feira"]
[null,15,"2010-04-09",4,6,"46","4Sexta-feira","Sexta-feira","","15Sexta-feira"]
[null,15,"2010-04-10",4,7,"47","4Sábado","Sábado","","15Sábado"]
[null,16,"2010-04-11",4,1,"41","4Domingo","Domingo","11-17","16Domingo"]
[null,16,"2010-04-12",4,2,"42","4Segunda-feira","Segunda-feira","","16Segunda-feira"]
[null,16,"2010-04-13",4,3,"43","4Terça-feira","Terça-feira","","16Terça-feira"]
[null,16,"2010-04-14",4,4,"44","4Quarta-feira","Quarta-feira","","16Quarta-feira"]
[null,16,"2010-04-15",4,5,"45","4Quinta-feira","Quinta-feira","","16Quinta-feira"]
[null,16,"2010-04-16",4,6,"46","4Sexta-feira","Sexta-feira","","16Sexta-feira"]
[null,16,"2010-04-17",4,7,"47","4Sábado","Sábado","","16Sábado"]
[null,17,"2010-04-18",4,1,"41","4Domingo","Domingo","18-24","17Domingo"]
[null,17,"2010-04-19",4,2,"42","4Segunda-feira","Segunda-feira","","17Segunda-feira"]
[null,17,"2010-04-20",4,3,"43","4Terça-feira","Terça-feira","","17Terça-feira"]
[null,17,"2010-04-21",4,4,"44","4Feriado","Feriado","","17Feriado"]
[null,17,"2010-04-22",4,5,"45","4Quinta-feira","Quinta-feira","","17Quinta-feira"]
[null,17,"2010-04-23",4,6,"46","4Sexta-feira","Sexta-feira","","17Sexta-feira"]
[null,17,"2010-04-24",4,7,"47","4Sábado","Sábado","","17Sábado"]
[null,18,"2010-04-25",4,1,"41","4Domingo","Domingo","25-01","18Domingo"]
[null,18,"2010-04-26",4,2,"42","4Segunda-feira","Segunda-feira","","18Segunda-feira"]
[null,18,"2010-04-27",4,3,"43","4Terça-feira","Terça-feira","","18Terça-feira"]
[null,18,"2010-04-28",4,4,"44","4Quarta-feira","Quarta-feira","","18Quarta-feira"]
[null,18,"2010-04-29",4,5,"45","4Quinta-feira","Quinta-feira","","18Quinta-feira"]
[null,18,"2010-04-30",4,6,"46","4Sexta-feira","Sexta-feira","","18Sexta-feira"]
[null,18,"2010-05-01",5,7,"57","","Feriado","","18Feriado"]
[null,19,"2010-05-02",5,1,"51","5Domingo","Domingo","02-08","19Domingo"]
[null,19,"2010-05-03",5,2,"52","5Segunda-feira","Segunda-feira","","19Segunda-feira"]
[null,19,"2010-05-04",5,3,"53","5Terça-feira","Terça-feira","","19Terça-feira"]
[null,19,"2010-05-05",5,4,"54","5Quarta-feira","Quarta-feira","","19Quarta-feira"]
[null,19,"2010-05-06",5,5,"55","5Quinta-feira","Quinta-feira","","19Quinta-feira"]
[null,19,"2010-05-07",5,6,"56","5Sexta-feira","Sexta-feira","","19Sexta-feira"]
[null,19,"2010-05-08",5,7,"57","5Sábado","Sábado","","19Sábado"]
[null,{"$f":"WEEKNUM(C134)","v":20},"2010-05-09",{"$f":"MONTH(C134)","v":5},{"$f":"WEEKDAY(C134)","v":1},"51","5Domingo",{"$f":"IF(ISNA(VLOOKUP(C134,feriados,1,FALSE)),VLOOKUP(WEEKDAY(C134,1),$R$6:$S$12,2,TRUE),\"Feriado\")","v":"Domingo"},"09-15",{"$f":"CONCATENATE(B134,H134)","v":"20Domingo"}]
[null,20,{"$f":"+C134+1","v":"2010-05-10"},5,2,{"$f":"D135&E135","v":"52"},{"$f":"IF(AND(OR(E135=1,E135=7),H135=\"feriado\"),\"\",CONCATENATE(D135,H135))","v":"5Segunda-feira"},"Segunda-feira",{"$f":"IF(E135=1,TEXT(DAY(C135),\"dd\")&\"-\"&TEXT(DAY(C135+7-E135),\"dd\"),\"\")","v":""},"20Segunda-feira"]
[null,20,"2010-05-11",5,3,"53","5Terça-feira","Terça-feira","","20Terça-feira"]
[null,20,"2010-05-12",5,4,"54","5Quarta-feira","Quarta-feira","","20Quarta-feira"]
[null,20,"2010-05-13",5,5,"55","5Quinta-feira","Quinta-feira","","20Quinta-feira"]
[null,20,"2010-05-14",5,6,"56","5Sexta-feira","Sexta-feira","","20Sexta-feira"]
[null,20,"2010-05-15",5,7,"57","5Sábado","Sábado","","20Sábado"]
[null,21,"2010-05-16",5,1,"51","5Domingo","Domingo","16-22","21Domingo"]
[null,21,"2010-05-17",5,2,"52","5Segunda-feira","Segunda-feira","","21Segunda-feira"]
[null,21,"2010-05-18",5,3,"53","5Terça-feira","Terça-feira","","21Terça-feira"]
[null,21,"2010-05-19",5,4,"54","5Quarta-feira","Quarta-feira","","21Quarta-feira"]
[null,21,"2010-05-20",5,5,"55","5Quinta-feira","Quinta-feira","","21Quinta-feira"]
[null,21,"2010-05-21",5,6,"56","5Sexta-feira","Sexta-feira","","21Sexta-feira"]
[null,21,"2010-05-22",5,7,"57","5Sábado","Sábado","","21Sábado"]
[null,22,"2010-05-23",5,1,"51","5Domingo","Domingo","23-29","22Domingo"]
[null,22,"2010-05-24",5,2,"52","5Segunda-feira","Segunda-feira","","22Segunda-feira"]
[null,22,"2010-05-25",5,3,"53","5Terça-feira","Terça-feira","","22Terça-feira"]
[null,22,"2010-05-26",5,4,"54","5Quarta-feira","Quarta-feira","","22Quarta-feira"]
[null,22,"2010-05-27",5,5,"55","5Quinta-feira","Quinta-feira","","22Quinta-feira"]
[null,22,"2010-05-28",5,6,"56","5Sexta-feira","Sexta-feira","","22Sexta-feira"]
[null,22,"2010-05-29",5,7,"57","5Sábado","Sábado","","22Sábado"]
[null,23,"2010-05-30",5,1,"51","5Domingo","Domingo","30-05","23Domingo"]
[null,23,"2010-05-31",5,2,"52","5Segunda-feira","Segunda-feira","","23Segunda-feira"]
[null,23,"2010-06-01",6,3,"63","6Terça-feira","Terça-feira","","23Terça-feira"]
[null,23,"2010-06-02",6,4,"64","6Quarta-feira","Quarta-feira","","23Quarta-feira"]
[null,23,"2010-06-03",6,5,"65","6Quinta-feira","Quinta-feira","","23Quinta-feira"]
[null,23,"2010-06-04",6,6,"66","6Sexta-feira","Sexta-feira","","23Sexta-feira"]
[null,23,"2010-06-05",6,7,"67","6Sábado","Sábado","","23Sábado"]
[null,24,"2010-06-06",6,1,"61","6Domingo","Domingo","06-12","24Domingo"]
[null,24,"2010-06-07",6,2,"62","6Segunda-feira","Segunda-feira","","24Segunda-feira"]
[null,24,"2010-06-08",6,3,"63","6Terça-feira","Terça-feira","","24Terça-feira"]
[null,24,"2010-06-09",6,4,"64","6Quarta-feira","Quarta-feira","","24Quarta-feira"]
[null,24,"2010-06-10",6,5,"65","6Quinta-feira","Quinta-feira","","24Quinta-feira"]
[null,24,"2010-06-11",6,6,"66","6Sexta-feira","Sexta-feira","","24Sexta-feira"]
[null,24,"2010-06-12",6,7,"67","6Sábado","Sábado","","24Sábado"]
[null,25,"2010-06-13",6,1,"61","6Domingo","Domingo","13-19","25Domingo"]
[null,25,"2010-06-14",6,2,"62","6Segunda-feira","Segunda-feira","","25Segunda-feira"]
[null,25,"2010-06-15",6,3,"63","6Terça-feira","Terça-feira","","25Terça-feira"]
[null,25,"2010-06-16",6,4,"64","6Quarta-feira","Quarta-feira","","25Quarta-feira"]
[null,25,"2010-06-17",6,5,"65","6Quinta-feira","Quinta-feira","","25Quinta-feira"]
[null,25,"2010-06-18",6,6,"66","6Sexta-feira","Sexta-feira","","25Sexta-feira"]
[null,25,"2010-06-19",6,7,"67","6Sábado","Sábado","","25Sábado"]
[null,26,"2010-06-20",6,1,"61","6Domingo","Domingo","20-26","26Domingo"]
[null,26,"2010-06-21",6,2,"62","6Segunda-feira","Segunda-feira","","26Segunda-feira"]
[null,26,"2010-06-22",6,3,"63","6Terça-feira","Terça-feira","","26Terça-feira"]
[null,26,"2010-06-23",6,4,"64","6Quarta-feira","Quarta-feira","","26Quarta-feira"]
[null,26,"2010-06-24",6,5,"65","6Quinta-feira","Quinta-feira","","26Quinta-feira"]
[null,26,"2010-06-25",6,6,"66","6Sexta-feira","Sexta-feira","","26Sexta-feira"]
[null,26,"2010-06-26",6,7,"67","6Sábado","Sábado","","26Sábado"]
[null,27,"2010-06-27",6,1,"61","6Domingo","Domingo","27-03","27Domingo"]
[null,27,"2010-06-28",6,2,"62","6Segunda-feira","Segunda-feira","","27Segunda-feira"]
[null,27,"2010-06-29",6,3,"63","6Terça-feira","Terça-feira","","27Terça-feira"]
[null,27,"2010-06-30",6,4,"64","6Quarta-feira","Quarta-feira","","27Quarta-feira"]
[null,27,"2010-07-01",7,5,"75","7Quinta-feira","Quinta-feira","","27Quinta-feira"]
[null,27,"2010-07-02",7,6,"76","7Sexta-feira","Sexta-feira","","27Sexta-feira"]
[null,27,"2010-07-03",7,7,"77","7Sábado","Sábado","","27Sábado"]
[null,28,"2010-07-04",7,1,"71","7Domingo","Domingo","04-10","28Domingo"]
[null,28,"2010-07-05",7,2,"72","7Segunda-feira","Segunda-feira","","28Segunda-feira"]
[null,28,"2010-07-06",7,3,"73","7Terça-feira","Terça-feira","","28Terça-feira"]
[null,28,"2010-07-07",7,4,"74","7Quarta-feira","Quarta-feira","","28Quarta-feira"]
[null,28,"2010-07-08",7,5,"75","7Quinta-feira","Quinta-feira","","28Quinta-feira"]
[null,28,"2010-07-09",7,6,"76","7Sexta-feira","Sexta-feira","","28Sexta-feira"]
[null,28,"2010-07-10",7,7,"77","7Sábado","Sábado","","28Sábado"]
[null,29,"2010-07-11",7,1,"71","7Domingo","Domingo","11-17","29Domingo"]
[null,{"$f":"WEEKNUM(C198)","v":29},"2010-07-12",{"$f":"MONTH(C198)","v":7},{"$f":"WEEKDAY(C198)","v":2},"72","7Segunda-feira",{"$f":"IF(ISNA(VLOOKUP(C198,feriados,1,FALSE)),VLOOKUP(WEEKDAY(C198,1),$R$6:$S$12,2,TRUE),\"Feriado\")","v":"Segunda-feira"},"",{"$f":"CONCATENATE(B198,H198)","v":"29Segunda-feira"}]
[null,29,{"$f":"+C198+1","v":"2010-07-13"},7,3,{"$f":"D199&E199","v":"73"},{"$f":"IF(AND(OR(E199=1,E199=7),H199=\"feriado\"),\"\",CONCATENATE(D199,H199))","v":"7Terça-feira"},"Terça-feira",{"$f":"IF(E199=1,TEXT(DAY(C199),\"dd\")&\"-\"&TEXT(DAY(C199+7-E199),\"dd\"),\"\")","v":""},"29Terça-feira"]
[null,29,"2010-07-14",7,4,"74","7Quarta-feira","Quarta-feira","","29Quarta-feira"]
[null,29,"2010-07-15",7,5,"75","7Quinta-feira","Quinta-feira","","29Quinta-feira"]
[null,29,"2010-07-16",7,6,"76","7Sexta-feira","Sexta-feira","","29Sexta-feira"]
[null,29,"2010-07-17",7,7,"77","7Sábado","Sábado","","29Sábado"]
[null,30,"2010-07-18",7,1,"71","7Domingo","Domingo","18-24","30Domingo"]
[null,30,"2010-07-19",7,2,"72","7Segunda-feira","Segunda-feira","","30Segunda-feira"]
[null,30,"2010-07-20",7,3,"73","7Terça-feira","Terça-feira","","30Terça-feira"]
[null,30,"2010-07-21",7,4,"74","7Quarta-feira","Quarta-feira","","30Quarta-feira"]
[null,30,"2010-07-22",7,5,"75","7Quinta-feira","Quinta-feira","","30Quinta-feira"]
[null,30,"2010-07-23",7,6,"76","7Sexta-feira","Sexta-feira","","30Sexta-feira"]
[null,30,"2010-07-24",7,7,"77","7Sábado","Sábado","","30Sábado"]
[null,31,"2010-07-25",7,1,"71","7Domingo","Domingo","25-31","31Domingo"]
[null,31,"2010-07-26",7,2,"72","7Segunda-feira","Segunda-feira","","31Segunda-feira"]
[null,31,"2010-07-27",7,3,"73","7Terça-feira","Terça-feira","","31Terça-feira"]
[null,31,"2010-07-28",7,4,"74","7Quarta-feira","Quarta-feira","","31Quarta-feira"]
[null,31,"2010-07-29",7,5,"75","7Quinta-feira","Quinta-feira","","31Quinta-feira"]
[null,31,"2010-07-30",7,6,"76","7Sexta-feira","Sexta-feira","","31Sexta-feira"]
[null,31,"2010-07-31",7,7,"77","7Sábado","Sábado","","31Sábado"]
[null,32,"2010-08-01",8,1,"81","8Domingo","Domingo","01-07","32Domingo"]
[null,32,"2010-08-02",8,2,"82","8Segunda-feira","Segunda-feira","","32Segunda-feira"]
[null,32,"2010-08-03",8,3,"83","8Terça-feira","Terça-feira","","32Terça-feira"]
[null,32,"2010-08-04",8,4,"84","8Quarta-feira","Quarta-feira","","32Quarta-feira"]
[null,32,"2010-08-05",8,5,"85","8Quinta-feira","Quinta-feira","","32Quinta-feira"]
[null,32,"2010-08-06",8,6,"86","8Sexta-feira","Sexta-feira","","32Sexta-feira"]
[null,32,"2010-08-07",8,7,"87","8Sábado","Sábado","","32Sábado"]
[null,33,"2010-08-08",8,1,"81","8Domingo","Domingo","08-14","33Domingo"]
[null,33,"2010-08-09",8,2,"82","8Segunda-feira","Segunda-feira","","33Segunda-feira"]
[null,33,"2010-08-10",8,3,"83","8Terça-feira","Terça-feira","","33Terça-feira"]
[null,33,"2010-08-11",8,4,"84","8Quarta-feira","Quarta-feira","","33Quarta-feira"]
[null,33,"2010-08-12",8,5,"85","8Quinta-feira","Quinta-feira","","33Quinta-feira"]
[null,33,"2010-08-13",8,6,"86","8Sexta-feira","Sexta-feira","","33Sexta-feira"]
[null,33,"2010-08-14",8,7,"87","8Sábado","Sábado","","33Sábado"]
[null,34,"2010-08-15",8,1,"81","8Domingo","Domingo","15-21","34Domingo"]
[null,34,"2010-08-16",8,2,"82","8Segunda-feira","Segunda-feira","","34Segunda-feira"]
[null,34,"2010-08-17",8,3,"83","8Terça-feira","Terça-feira","","34Terça-feira"]
[null,34,"2010-08-18",8,4,"84","8Quarta-feira","Quarta-feira","","34Quarta-feira"]
[null,34,"2010-08-19",8,5,"85","8Quinta-feira","Quinta-feira","","34Quinta-feira"]
[null,34,"2010-08-20",8,6,"86","8Sexta-feira","Sexta-feira","","34Sexta-feira"]
[null,34,"2010-08-21",8,7,"87","8Sábado","Sábado","","34Sábado"]
[null,35,"2010-08-22",8,1,"81","8Domingo","Domingo","22-28","35Domingo"]
[null,35,"2010-08-23",8,2,"82","8Segunda-feira","Segunda-feira","","35Segunda-feira"]
[null,35,"2010-08-24",8,3,"83","8Terça-feira","Terça-feira","","35Terça-feira"]
[null,35,"2010-08-25",8,4,"84","8Quarta-feira","Quarta-feira","","35Quarta-feira"]
[null,35,"2010-08-26",8,5,"85","8Quinta-feira","Quinta-feira","","35Quinta-feira"]
[null,35,"2010-08-27",8,6,"86","8Sexta-feira","Sexta-feira","","35Sexta-feira"]
[null,35,"2010-08-28",8,7,"87","8Sábado","Sábado","","35Sábado"]
[null,36,"2010-08-29",8,1,"81","8Domingo","Domingo","29-04","36Domingo"]
[null,36,"2010-08-30",8,2,"82","8Segunda-feira","Segunda-feira","","36Segunda-feira"]
[null,36,"2010-08-31",8,3,"83","8Terça-feira","Terça-feira","","36Terça-feira"]
[null,36,"2010-09-01",9,4,"94","9Quarta-feira","Quarta-feira","","36Quarta-feira"]
[null,36,"2010-09-02",9,5,"95","9Quinta-feira","Quinta-feira","","36Quinta-feira"]
[null,36,"2010-09-03",9,6,"96","9Sexta-feira","Sexta-feira","","36Sexta-feira"]
[null,36,"2010-09-04",9,7,"97","9Sábado","Sábado","","36Sábado"]
[null,37,"2010-09-05",9,1,"91","9Domingo","Domingo","05-11","37Domingo"]
[null,37,"2010-09-06",9,2,"92","9Segunda-feira","Segunda-feira","","37Segunda-feira"]
[null,37,"2010-09-07",9,3,"93","9Feriado","Feriado","","37Feriado"]
[null,37,"2010-09-08",9,4,"94","9Quarta-feira","Quarta-feira","","37Quarta-feira"]
[null,37,"2010-09-09",9,5,"95","9Quinta-feira","Quinta-feira","","37Quinta-feira"]
[null,37,"2010-09-10",9,6,"96","9Sexta-feira","Sexta-feira","","37Sexta-feira"]
[null,37,"2010-09-11",9,7,"97","9Sábado","Sábado","","37Sábado"]
[null,38,"2010-09-12",9,1,"91","9Domingo","Domingo","12-18","38Domingo"]
[null,38,"2010-09-13",9,2,"92","9Segunda-feira","Segunda-feira","","38Segunda-feira"]
[null,{"$f":"WEEKNUM(C262)","v":38},"2010-09-14",{"$f":"MONTH(C262)","v":9},{"$f":"WEEKDAY(C262)","v":3},"93","9Terça-feira",{"$f":"IF(ISNA(VLOOKUP(C262,feriados,1,FALSE)),VLOOKUP(WEEKDAY(C262,1),$R$6:$S$12,2,TRUE),\"Feriado\")","v":"Terça-feira"},"",{"$f":"CONCATENATE(B262,H262)","v":"38Terça-feira"}]
[null,38,{"$f":"+C262+1","v":"2010-09-15"},9,4,{"$f":"D263&E263","v":"94"},{"$f":"IF(AND(OR(E263=1,E263=7),H263=\"feriado\"),\"\",CONCATENATE(D263,H263))","v":"9Quarta-feira"},"Quarta-feira",{"$f":"IF(E263=1,TEXT(DAY(C263),\"dd\")&\"-\"&TEXT(DAY(C263+7-E263),\"dd\"),\"\")","v":""},"38Quarta-feira"]
[null,38,"2010-09-16",9,5,"95","9Quinta-feira","Quinta-feira","","38Quinta-feira"]
[null,38,"2010-09-17",9,6,"96","9Sexta-feira","Sexta-feira","","38Sexta-feira"]
[null,38,"2010-09-18",9,7,"97","9Sábado","Sábado","","38Sábado"]
[null,39,"2010-09-19",9,1,"91","9Domingo","Domingo","19-25","39Domingo"]
[null,39,"2010-09-20",9,2,"92","9Segunda-feira","Segunda-feira","","39Segunda-feira"]
[null,39,"2010-09-21",9,3,"93","9Terça-feira","Terça-feira","","39Terça-feira"]
[null,39,"2010-09-22",9,4,"94","9Quarta-feira","Quarta-feira","","39Quarta-feira"]
[null,39,"2010-09-23",9,5,"95","9Quinta-feira","Quinta-feira","","39Quinta-feira"]
[null,39,"2010-09-24",9,6,"96","9Sexta-feira","Sexta-feira","","39Sexta-feira"]
[null,39,"2010-09-25",9,7,"97","9Sábado","Sábado","","39Sábado"]
[null,40,"2010-09-26",9,1,"91","9Domingo","Domingo","26-02","40Domingo"]
[null,40,"2010-09-27",9,2,"92","9Segunda-feira","Segunda-feira","","40Segunda-feira"]
[null,40,"2010-09-28",9,3,"93","9Terça-feira","Terça-feira","","40Terça-feira"]
[null,40,"2010-09-29",9,4,"94","9Quarta-feira","Quarta-feira","","40Quarta-feira"]
[null,40,"2010-09-30",9,5,"95","9Quinta-feira","Quinta-feira","","40Quinta-feira"]
[null,40,"2010-10-01",10,6,"106","10Sexta-feira","Sexta-feira","","40Sexta-feira"]
[null,40,"2010-10-02",10,7,"107","10Sábado","Sábado","","40Sábado"]
[null,41,"2010-10-03",10,1,"101","10Domingo","Domingo","03-09","41Domingo"]
[null,41,"2010-10-04",10,2,"102","10Segunda-feira","Segunda-feira","","41Segunda-feira"]
[null,41,"2010-10-05",10,3,"103","10Terça-feira","Terça-feira","","41Terça-feira"]
[null,41,"2010-10-06",10,4,"104","10Quarta-feira","Quarta-feira","","41Quarta-feira"]
[null,41,"2010-10-07",10,5,"105","10Quinta-feira","Quinta-feira","","41Quinta-feira"]
[null,41,"2010-10-08",10,6,"106","10Sexta-feira","Sexta-feira","","41Sexta-feira"]
[null,41,"2010-10-09",10,7,"107","10Sábado","Sábado","","41Sábado"]
[null,42,"2010-10-10",10,1,"101","10Domingo","Domingo","10-16","42Domingo"]
[null,42,"2010-10-11",10,2,"102","10Segunda-feira","Segunda-feira","","42Segunda-feira"]
[null,42,"2010-10-12",10,3,"103","10Terça-feira","Terça-feira","","42Terça-feira"]
[null,42,"2010-10-13",10,4,"104","10Quarta-feira","Quarta-feira","","42Quarta-feira"]
[null,42,"2010-10-14",10,5,"105","10Quinta-feira","Quinta-feira","","42Quinta-feira"]
[null,42,"2010-10-15",10,6,"106","10Sexta-feira","Sexta-feira","","42Sexta-feira"]
[null,42,"2010-10-16",10,7,"107","10Sábado","Sábado","","42Sábado"]
[null,43,"2010-10-17",10,1,"101","10Domingo","Domingo","17-23","43Domingo"]
[null,43,"2010-10-18",10,2,"102","10Segunda-feira","Segunda-feira","","43Segunda-feira"]
[null,43,"2010-10-19",10,3,"103","10Terça-feira","Terça-feira","","43Terça-feira"]
[null,43,"2010-10-20",10,4,"104","10Quarta-feira","Quarta-feira","","43Quarta-feira"]
[null,43,"2010-10-21",10,5,"105","10Quinta-feira","Quinta-feira","","43Quinta-feira"]
[null,43,"2010-10-22",10,6,"106","10Sexta-feira","Sexta-feira","","43Sexta-feira"]
[null,43,"2010-10-23",10,7,"107","10Sábado","Sábado","","43Sábado"]
[null,44,"2010-10-24",10,1,"101","10Domingo","Domingo","24-30","44Domingo"]
[null,44,"2010-10-25",10,2,"102","10Segunda-feira","Segunda-feira","","44Segunda-feira"]
[null,44,"2010-10-26",10,3,"103","10Terça-feira","Terça-feira","","44Terça-feira"]
[null,44,"2010-10-27",10,4,"104","10Quarta-feira","Quarta-feira","","44Quarta-feira"]
[null,44,"2010-10-28",10,5,"105","10Quinta-feira","Quinta-feira","","44Quinta-feira"]
[null,44,"2010-10-29",10,6,"106","10Sexta-feira","Sexta-feira","","44Sexta-feira"]
[null,44,"2010-10-30",10,7,"107","10Sábado","Sábado","","44Sábado"]
[null,45,"2010-10-31",10,1,"101","10Domingo","Domingo","31-06","45Domingo"]
[null,45,"2010-11-01",11,2,"112","11Segunda-feira","Segunda-feira","","45Segunda-feira"]
[null,45,"2010-11-02",11,3,"113","11Feriado","Feriado","","45Feriado"]
[null,45,"2010-11-03",11,4,"114","11Quarta-feira","Quarta-feira","","45Quarta-feira"]
[null,45,"2010-11-04",11,5,"115","11Quinta-feira","Quinta-feira","","45Quinta-feira"]
[null,45,"2010-11-05",11,6,"116","11Sexta-feira","Sexta-feira","","45Sexta-feira"]
[null,45,"2010-11-06",11,7,"117","11Sábado","Sábado","","45Sábado"]
[null,46,"2010-11-07",11,1,"111","11Domingo","Domingo","07-13","46Domingo"]
[null,46,"2010-11-08",11,2,"112","11Segunda-feira","Segunda-feira","","46Segunda-feira"]
[null,46,"2010-11-09",11,3,"113","11Terça-feira","Terça-feira","","46Terça-feira"]
[null,46,"2010-11-10",11,4,"114","11Quarta-feira","Quarta-feira","","46Quarta-feira"]
[null,46,"2010-11-11",11,5,"115","11Quinta-feira","Quinta-feira","","46Quinta-feira"]
[null,46,"2010-11-12",11,6,"116","11Sexta-feira","Sexta-feira","","46Sexta-feira"]
[null,46,"2010-11-13",11,7,"117","11Sábado","Sábado","","46Sábado"]
[null,47,"2010-11-14",11,1,"111","11Domingo","Domingo","14-20","47Domingo"]
[null,47,"2010-11-15",11,2,"112","11Feriado","Feriado","","47Feriado"]
[null,47,"2010-11-16",11,3,"113","11Terça-feira","Terça-feira","","47Terça-feira"]
[null,{"$f":"WEEKNUM(C326)","v":47},"2010-11-17",{"$f":"MONTH(C326)","v":11},{"$f":"WEEKDAY(C326)","v":4},"114","11Quarta-feira",{"$f":"IF(ISNA(VLOOKUP(C326,feriados,1,FALSE)),VLOOKUP(WEEKDAY(C326,1),$R$6:$S$12,2,TRUE),\"Feriado\")","v":"Quarta-feira"},"",{"$f":"CONCATENATE(B326,H326)","v":"47Quarta-feira"}]
[null,47,{"$f":"+C326+1","v":"2010-11-18"},11,5,{"$f":"D327&E327","v":"115"},{"$f":"IF(AND(OR(E327=1,E327=7),H327=\"feriado\"),\"\",CONCATENATE(D327,H327))","v":"11Quinta-feira"},"Quinta-feira",{"$f":"IF(E327=1,TEXT(DAY(C327),\"dd\")&\"-\"&TEXT(DAY(C327+7-E327),\"dd\"),\"\")","v":""},"47Quinta-feira"]
[null,47,"2010-11-19",11,6,"116","11Sexta-feira","Sexta-feira","","47Sexta-feira"]
[null,47,"2010-11-20",11,7,"117","","Feriado","","47Feriado"]
[null,48,"2010-11-21",11,1,"111","11Domingo","Domingo","21-27","48Domingo"]
[null,48,"2010-11-22",11,2,"112","11Segunda-feira","Segunda-feira","","48Segunda-feira"]
[null,48,"2010-11-23",11,3,"113","11Terça-feira","Terça-feira","","48Terça-feira"]
[null,48,"2010-11-24",11,4,"114","11Quarta-feira","Quarta-feira","","48Quarta-feira"]
[null,48,"2010-11-25",11,5,"115","11Quinta-feira","Quinta-feira","","48Quinta-feira"]
[null,48,"2010-11-26",11,6,"116","11Sexta-feira","Sexta-feira","","48Sexta-feira"]
[null,48,"2010-11-27",11,7,"117","11Sábado","Sábado","","48Sábado"]
[null,49,"2010-11-28",11,1,"111","11Domingo","Domingo","28-04","49Domingo"]
[null,49,"2010-11-29",11,2,"112","11Segunda-feira","Segunda-feira","","49Segunda-feira"]
[null,49,"2010-11-30",11,3,"113","11Terça-feira","Terça-feira","","49Terça-feira"]
[null,49,"2010-12-01",12,4,"124","12Quarta-feira","Quarta-feira","","49Quarta-feira"]
[null,49,"2010-12-02",12,5,"125","12Quinta-feira","Quinta-feira","","49Quinta-feira"]
[null,49,"2010-12-03",12,6,"126","12Sexta-feira","Sexta-feira","","49Sexta-feira"]
[null,49,"2010-12-04",12,7,"127","12Sábado","Sábado","","49Sábado"]
[null,50,"2010-12-05",12,1,"121","12Domingo","Domingo","05-11","50Domingo"]
[null,50,"2010-12-06",12,2,"122","12Segunda-feira","Segunda-feira","","50Segunda-feira"]
[null,50,"2010-12-07",12,3,"123","12Terça-feira","Terça-feira","","50Terça-feira"]
[null,50,"2010-12-08",12,4,"124","12Quarta-feira","Quarta-feira","","50Quarta-feira"]
[null,50,"2010-12-09",12,5,"125","12Quinta-feira","Quinta-feira","","50Quinta-feira"]
[null,50,"2010-12-10",12,6,"126","12Sexta-feira","Sexta-feira","","50Sexta-feira"]
[null,50,"2010-12-11",12,7,"127","12Sábado","Sábado","","50Sábado"]
[null,51,"2010-12-12",12,1,"121","12Domingo","Domingo","12-18","51Domingo"]
[null,51,"2010-12-13",12,2,"122","12Segunda-feira","Segunda-feira","","51Segunda-feira"]
[null,51,"2010-12-14",12,3,"123","12Terça-feira","Terça-feira","","51Terça-feira"]
[null,51,"2010-12-15",12,4,"124","12Quarta-feira","Quarta-feira","","51Quarta-feira"]
[null,51,"2010-12-16",12,5,"125","12Quinta-feira","Quinta-feira","","51Quinta-feira"]
[null,51,"2010-12-17",12,6,"126","12Sexta-feira","Sexta-feira","","51Sexta-feira"]
[null,51,"2010-12-18",12,7,"127","12Sábado","Sábado","","51Sábado"]
[null,52,"2010-12-19",12,1,"121","12Domingo","Domingo","19-25","52Domingo"]
[null,52,"2010-12-20",12,2,"122","12Segunda-feira","Segunda-feira","","52Segunda-feira"]
[null,52,"2010-12-21",12,3,"123","12Terça-feira","Terça-feira","","52Terça-feira"]
[null,52,"2010-12-22",12,4,"124","12Quarta-feira","Quarta-feira","","52Quarta-feira"]
[null,52,"2010-12-23",12,5,"125","12Quinta-feira","Quinta-feira","","52Quinta-feira"]
[null,52,"2010-12-24",12,6,"126","12Sexta-feira","Sexta-feira","","52Sexta-feira"]
[null,52,"2010-12-25",12,7,"127","","Feriado","","52Feriado"]
[null,53,"2010-12-26",12,1,"121","12Domingo","Domingo","26-01","53Domingo"]
[null,53,"2010-12-27",12,2,"122","12Segunda-feira","Segunda-feira","","53Segunda-feira"]
[null,53,"2010-12-28",12,3,"123","12Terça-feira","Terça-feira","","53Terça-feira"]
[null,53,"2010-12-29",12,4,"124","12Quarta-feira","Quarta-feira","","53Quarta-feira"]
[null,53,"2010-12-30",12,5,"125","12Quinta-feira","Quinta-feira","","53Quinta-feira"]
[null,53,"2010-12-31",12,6,"126","12Sexta-feira","Sexta-feira","","53Sexta-feira"]
[null,{"$f":"IF(C371=\"\",\"\",WEEKNUM(C371))","v":""},{"$f":"IF(YEAR(C370)<>YEAR(C370+1),\"\",C370+1)","v":""},{"$f":"IF(C371=\"\",\"\",MONTH(C371))","v":""},{"$f":"IF(C371=\"\",\"\",WEEKDAY(C371))","v":""},"","",{"$f":"IF(C371=\"\",\"\",IF(ISNA(VLOOKUP(C371,feriados,1,FALSE)),VLOOKUP(WEEKDAY(C371,1),$R$6:$S$12,2,TRUE),\"Feriado\"))","v":""},{"$f":"IF(C371=\"\",\"\",IF(E371=1,TEXT(DAY(C371),\"dd\")&\"-\"&TEXT(DAY(C371+7-E371),\"dd\"),\"\"))","v":""},""]